none
Error when attempting to Build RRS feed

  • Question

  • I receive the following errors when I attempt the build. This is at the  "BUILD | Rebuild Solution" step. Please advise. Thank you.

    1>------ Rebuild All started: Project: WorkflowActivityLibrary, Configuration: Release Any CPU ------
    1>C:\Windows\Microsoft.NET\Framework\v4.0.30319\Workflow.targets(121,5): error : 'Microsoft.ResourceManagement.Workflow.Activities.CreateResourceActivity' does not contain a definition for 'AuthorizationWaitTimeInSeconds' and no extension method 'AuthorizationWaitTimeInSeconds' accepting a first argument of type 'Microsoft.ResourceManagement.Workflow.Activities.CreateResourceActivity' could be found (are you missing a using directive or an assembly reference?)
    1>C:\Windows\Microsoft.NET\Framework\v4.0.30319\Workflow.targets(121,5): error : 'Microsoft.ResourceManagement.Workflow.Activities.DeleteResourceActivity' does not contain a definition for 'AuthorizationWaitTimeInSeconds' and no extension method 'AuthorizationWaitTimeInSeconds' accepting a first argument of type 'Microsoft.ResourceManagement.Workflow.Activities.DeleteResourceActivity' could be found (are you missing a using directive or an assembly reference?)
    2>------ Rebuild All started: Project: WorkflowActivityLibrary.UI, Configuration: Release Any CPU ------
    2>CSC : error CS0006: Metadata file 'C:\MIMWAL-2.16.0320.0\src\WorkflowActivityLibrary\bin\Release\MicrosoftServices.IdentityManagement.WorkflowActivityLibrary.dll' could not be found
    ========== Rebuild All: 0 succeeded, 2 failed, 0 skipped ==========

    Tuesday, April 5, 2016 7:14 PM

Answers

All replies